Reaction Details
TargetPeroxisome proliferator-activated receptor gamma
LigandBDBM50317109
Substrate/Competitorn/a
Meas. Tech.ChEMBL_630655 (CHEMBL1111089)
EC50 9193±n/a nM
Citation Ye, XYChen, SZhang, HLocke, KTO'Malley, KZhang, LSrivastava, RMiao, BMeyers, DMonshizadegan, HSearch, DGrimm, DZhang, RLippy, JTwamley, CMuckelbauer, JKChang, CAn, YHosagrahara, VZhang, LYang, TJMukherjee, RCheng, PTTino, JA Synthesis and structure-activity relationships of 2-aryl-4-oxazolylmethoxy benzylglycines and 2-aryl-4-thiazolylmethoxy benzylglycines as novel, potent PPARalpha selective activators- PPARalpha and PPARgamma selectivity modulation. Bioorg Med Chem Lett20:2933-7 (2010) 
 
Peroxisome proliferator-activated receptor gamma
Name:Peroxisome proliferator-activated receptor gamma
Type:Nuclear Receptor
Mol. Mass.:57613.46
Organism:Homo sapiens (Human)
Description:P37231
Residue:505
BDBM50317109
NameBDBM50317109
Synonyms:2-((3-((2-(4-chlorophenyl)oxazol-4-yl)methoxy)benzyl)(methoxycarbonyl)amino)acetic acid | CHEMBL1097193
TypeSmall organic molecule
Emp. Form.C21H19ClN2O6
Mol. Mass.430.838
SMILESCOC(=O)N(CC(O)=O)Cc1cccc(OCc2coc(n2)-c2ccc(Cl)cc2)c1