Reaction Details
TargetPeroxisome proliferator-activated receptor gamma
LigandBDBM50317113
Substrate/Competitorn/a
Meas. Tech.ChEMBL_630655 (CHEMBL1111089)
EC50>25000±n/a nM
Citation Ye, XYChen, SZhang, HLocke, KTO'Malley, KZhang, LSrivastava, RMiao, BMeyers, DMonshizadegan, HSearch, DGrimm, DZhang, RLippy, JTwamley, CMuckelbauer, JKChang, CAn, YHosagrahara, VZhang, LYang, TJMukherjee, RCheng, PTTino, JA Synthesis and structure-activity relationships of 2-aryl-4-oxazolylmethoxy benzylglycines and 2-aryl-4-thiazolylmethoxy benzylglycines as novel, potent PPARalpha selective activators- PPARalpha and PPARgamma selectivity modulation. Bioorg Med Chem Lett20:2933-7 (2010) 
 
Peroxisome proliferator-activated receptor gamma
Name:Peroxisome proliferator-activated receptor gamma
Type:Nuclear Receptor
Mol. Mass.:57613.46
Organism:Homo sapiens (Human)
Description:P37231
Residue:505
BDBM50317113
NameBDBM50317113
Synonyms:2-(methoxycarbonyl(3-((2-phenyloxazol-4-yl)methoxy)benzyl)amino)acetic acid | CHEMBL1087581
TypeSmall organic molecule
Emp. Form.C21H20N2O6
Mol. Mass.396.3933
SMILESCOC(=O)N(CC(O)=O)Cc1cccc(OCc2coc(n2)-c2ccccc2)c1