Reaction Details
TargetPeroxisome proliferator-activated receptor gamma
LigandBDBM50317126
Substrate/Competitorn/a
Meas. Tech.ChEMBL_630655 (CHEMBL1111089)
EC50 571±n/a nM
Citation Ye, XYChen, SZhang, HLocke, KTO'Malley, KZhang, LSrivastava, RMiao, BMeyers, DMonshizadegan, HSearch, DGrimm, DZhang, RLippy, JTwamley, CMuckelbauer, JKChang, CAn, YHosagrahara, VZhang, LYang, TJMukherjee, RCheng, PTTino, JA Synthesis and structure-activity relationships of 2-aryl-4-oxazolylmethoxy benzylglycines and 2-aryl-4-thiazolylmethoxy benzylglycines as novel, potent PPARalpha selective activators- PPARalpha and PPARgamma selectivity modulation. Bioorg Med Chem Lett20:2933-7 (2010) 
 
Peroxisome proliferator-activated receptor gamma
Name:Peroxisome proliferator-activated receptor gamma
Type:Nuclear Receptor
Mol. Mass.:57613.46
Organism:Homo sapiens (Human)
Description:P37231
Residue:505
BDBM50317126
NameBDBM50317126
Synonyms:(S)-2-((1-(3-((2-(4-chlorophenyl)oxazol-4-yl)methoxy)phenyl)ethyl)(m-tolyloxycarbonyl)amino)acetic acid | CHEMBL1088099
TypeSmall organic molecule
Emp. Form.C28H25ClN2O6
Mol. Mass.520.961
SMILESC[C@H](N(CC(O)=O)C(=O)Oc1cccc(C)c1)c1cccc(OCc2coc(n2)-c2ccc(Cl)cc2)c1