Reaction Details
TargetPeroxisome proliferator-activated receptor alpha
LigandBDBM50317118
Substrate/Competitorn/a
Meas. Tech.ChEMBL_630653 (CHEMBL1111087)
EC50 87±n/a nM
Citation Ye, XYChen, SZhang, HLocke, KTO'Malley, KZhang, LSrivastava, RMiao, BMeyers, DMonshizadegan, HSearch, DGrimm, DZhang, RLippy, JTwamley, CMuckelbauer, JKChang, CAn, YHosagrahara, VZhang, LYang, TJMukherjee, RCheng, PTTino, JA Synthesis and structure-activity relationships of 2-aryl-4-oxazolylmethoxy benzylglycines and 2-aryl-4-thiazolylmethoxy benzylglycines as novel, potent PPARalpha selective activators- PPARalpha and PPARgamma selectivity modulation. Bioorg Med Chem Lett20:2933-7 (2010) 
 
Peroxisome proliferator-activated receptor alpha
Name:Peroxisome proliferator-activated receptor alpha
Type:Enzyme
Mol. Mass.:52222.08
Organism:Homo sapiens (Human)
Description:Q07869
Residue:468
BDBM50317118
NameBDBM50317118
Synonyms:(S)-2-(methoxycarbonyl(1-(3-((2-p-tolyloxazol-4-yl)methoxy)phenyl)ethyl)amino)acetic acid | CHEMBL1087587
TypeSmall organic molecule
Emp. Form.C23H24N2O6
Mol. Mass.424.4465
SMILESCOC(=O)N(CC(O)=O)[C@@H](C)c1cccc(OCc2coc(n2)-c2ccc(C)cc2)c1