Reaction Details
TargetPeroxisome proliferator-activated receptor alpha
LigandBDBM50317122
Substrate/Competitorn/a
Meas. Tech.ChEMBL_630653 (CHEMBL1111087)
EC50 304±n/a nM
Citation Ye, XYChen, SZhang, HLocke, KTO'Malley, KZhang, LSrivastava, RMiao, BMeyers, DMonshizadegan, HSearch, DGrimm, DZhang, RLippy, JTwamley, CMuckelbauer, JKChang, CAn, YHosagrahara, VZhang, LYang, TJMukherjee, RCheng, PTTino, JA Synthesis and structure-activity relationships of 2-aryl-4-oxazolylmethoxy benzylglycines and 2-aryl-4-thiazolylmethoxy benzylglycines as novel, potent PPARalpha selective activators- PPARalpha and PPARgamma selectivity modulation. Bioorg Med Chem Lett20:2933-7 (2010) 
 
Peroxisome proliferator-activated receptor alpha
Name:Peroxisome proliferator-activated receptor alpha
Type:Enzyme
Mol. Mass.:52222.08
Organism:Homo sapiens (Human)
Description:Q07869
Residue:468
BDBM50317122
NameBDBM50317122
Synonyms:2-(methoxycarbonyl(3-((2-phenylthiazol-4-yl)methoxy)benzyl)amino)acetic acid | CHEMBL1087594
TypeSmall organic molecule
Emp. Form.C21H20N2O5S
Mol. Mass.412.459
SMILESCOC(=O)N(CC(O)=O)Cc1cccc(OCc2csc(n2)-c2ccccc2)c1