Reaction Details
TargetPeroxisome proliferator-activated receptor alpha
LigandBDBM50317129
Substrate/Competitorn/a
Meas. Tech.ChEMBL_630653 (CHEMBL1111087)
EC50 471±n/a nM
Citation Ye, XYChen, SZhang, HLocke, KTO'Malley, KZhang, LSrivastava, RMiao, BMeyers, DMonshizadegan, HSearch, DGrimm, DZhang, RLippy, JTwamley, CMuckelbauer, JKChang, CAn, YHosagrahara, VZhang, LYang, TJMukherjee, RCheng, PTTino, JA Synthesis and structure-activity relationships of 2-aryl-4-oxazolylmethoxy benzylglycines and 2-aryl-4-thiazolylmethoxy benzylglycines as novel, potent PPARalpha selective activators- PPARalpha and PPARgamma selectivity modulation. Bioorg Med Chem Lett20:2933-7 (2010) 
 
Peroxisome proliferator-activated receptor alpha
Name:Peroxisome proliferator-activated receptor alpha
Type:Enzyme
Mol. Mass.:52222.08
Organism:Homo sapiens (Human)
Description:Q07869
Residue:468
BDBM50317129
NameBDBM50317129
Synonyms:(S)-2-((1-(3-((2-(4-chlorophenyl)oxazol-4-yl)methoxy)phenyl)ethyl)((2-fluoro-5-methylphenoxy)carbonyl)amino)acetic acid | CHEMBL1088246
TypeSmall organic molecule
Emp. Form.C28H24ClFN2O6
Mol. Mass.538.951
SMILESC[C@H](N(CC(O)=O)C(=O)Oc1cc(C)ccc1F)c1cccc(OCc2coc(n2)-c2ccc(Cl)cc2)c1