Reaction Details
TargetLeukotriene B4 receptor 1
LigandBDBM50317631
Substrate/Competitorn/a
Meas. Tech.ChEMBL_632889 (CHEMBL1107471)
IC50 0.18±n/a nM
Citation Goodnow, RAHicks, ASidduri, AKowalczyk, ADominique, RQiao, QLou, JPGillespie, PFotouhi, NTilley, JCohen, NChoudhry, SCavallo, GTannu, SAVentre, JDLavelle, DTare, NSOh, HLamb, MKurylko, GHamid, RWright, MBPamidimukkala, AEgan, TGubler, UHoffman, AFWei, XLi, YLO'Neil, JMarcano, RPozzani, KMolinaro, TSantiago, JSinger, LHargaden, MMoore, DCatala, ARChao, LCHermann, GVenkat, RMancebo, HRenzetti, LM Discovery of novel and potent leukotriene B4 receptor antagonists. Part 1. J Med Chem53:3502-16 (2010) 
 
Leukotriene B4 receptor 1
Name:Leukotriene B4 receptor 1
Type:Enzyme Catalytic Domain
Mol. Mass.:37582.68
Organism:Homo sapiens (Human)
Description:Q15722
Residue:352
BDBM50317631
NameBDBM50317631
Synonyms:4-{2-(2-Carboxy-ethyl)-3-[6-(3'-fluoro-5-pyridin-4-yl-biphenyl-3-yloxy)-hexyl]-phenoxy}-butyric acid | CHEMBL1099335
TypeSmall organic molecule
Emp. Form.C36H38FNO6
Mol. Mass.599.6884
SMILESOC(=O)CCCOc1cccc(CCCCCCOc2cc(cc(c2)-c2cccc(F)c2)-c2ccncc2)c1CCC(O)=O