Reaction Details
TargetCytochrome P450 2C9
LigandBDBM50317628
Substrate/Competitorn/a
Meas. Tech.ChEMBL_632904 (CHEMBL1107486)
IC50 340±n/a nM
Citation Goodnow, RAHicks, ASidduri, AKowalczyk, ADominique, RQiao, QLou, JPGillespie, PFotouhi, NTilley, JCohen, NChoudhry, SCavallo, GTannu, SAVentre, JDLavelle, DTare, NSOh, HLamb, MKurylko, GHamid, RWright, MBPamidimukkala, AEgan, TGubler, UHoffman, AFWei, XLi, YLO'Neil, JMarcano, RPozzani, KMolinaro, TSantiago, JSinger, LHargaden, MMoore, DCatala, ARChao, LCHermann, GVenkat, RMancebo, HRenzetti, LM Discovery of novel and potent leukotriene B4 receptor antagonists. Part 1. J Med Chem53:3502-16 (2010) 
 
Cytochrome P450 2C9
Name:Cytochrome P450 2C9
Type:Enzyme
Mol. Mass.:55636.33
Organism:Homo sapiens (Human)
Description:P11712
Residue:490
BDBM50317628
NameBDBM50317628
Synonyms:4-{2-(2-Carboxy-ethyl)-3-[6-(3,5-di-pyridin-4-yl-phenoxy)-hexyl]-phenoxy}-butyric acid | CHEMBL1099326
TypeSmall organic molecule
Emp. Form.C35H38N2O6
Mol. Mass.582.686
SMILESOC(=O)CCCOc1cccc(CCCCCCOc2cc(cc(c2)-c2ccncc2)-c2ccncc2)c1CCC(O)=O