Reaction Details
TargetLeukotriene B4 receptor 1
LigandBDBM50317638
Substrate/Competitorn/a
Meas. Tech.ChEMBL_632889 (CHEMBL1107471)
IC50 0.58±n/a nM
Citation Goodnow, RAHicks, ASidduri, AKowalczyk, ADominique, RQiao, QLou, JPGillespie, PFotouhi, NTilley, JCohen, NChoudhry, SCavallo, GTannu, SAVentre, JDLavelle, DTare, NSOh, HLamb, MKurylko, GHamid, RWright, MBPamidimukkala, AEgan, TGubler, UHoffman, AFWei, XLi, YLO'Neil, JMarcano, RPozzani, KMolinaro, TSantiago, JSinger, LHargaden, MMoore, DCatala, ARChao, LCHermann, GVenkat, RMancebo, HRenzetti, LM Discovery of novel and potent leukotriene B4 receptor antagonists. Part 1. J Med Chem53:3502-16 (2010) 
 
Leukotriene B4 receptor 1
Name:Leukotriene B4 receptor 1
Type:Enzyme Catalytic Domain
Mol. Mass.:37582.68
Organism:Homo sapiens (Human)
Description:Q15722
Residue:352
BDBM50317638
NameBDBM50317638
Synonyms:4-{2-(2-Carboxy-ethyl)-3-[6-(3,5-di-thiophen-3-yl-phenoxy)-hexyl]-phenoxy}-butyric acid | CHEMBL1098550
TypeSmall organic molecule
Emp. Form.C33H36O6S2
Mol. Mass.592.765
SMILESOC(=O)CCCOc1cccc(CCCCCCOc2cc(cc(c2)-c2ccsc2)-c2ccsc2)c1CCC(O)=O