Reaction Details
TargetHistamine H3 receptor
LigandBDBM50317713
Substrate/Competitorn/a
Meas. Tech.ChEMBL_629414 (CHEMBL1105767)
Ki 2.8±n/a nM
Citation Stocking, EMAluisio, LAtack, JRBonaventure, PCarruthers, NIDugovic, CEverson, AFraser, IJiang, XLeung, PLord, BLy, KSMorton, KLNepomuceno, DShah, CRShelton, JSoyode-Johnson, ALetavic, MA Novel substituted pyrrolidines are high affinity histamine H3 receptor antagonists. Bioorg Med Chem Lett20:2755-60 (2010) 
 
Histamine H3 receptor
Name:Histamine H3 receptor
Type:G Protein-Coupled Receptor (GPCR)
Mol. Mass.:48691.47
Organism:Homo sapiens (Human)
Description:Binding assays were using CHO cells stably expressing hH3R receptors.
Residue:445
BDBM50317713
NameBDBM50317713
Synonyms:(4-cyclobutyl-1,4-diazepan-1-yl)((2R,4S)-4-(4-(methylthio)phenoxy)pyrrolidin-2-yl)methanone | CHEMBL1095547
TypeSmall organic molecule
Emp. Form.C21H31N3O2S
Mol. Mass.389.555
SMILESCSc1ccc(O[C@@H]2CN[C@H](C2)C(=O)N2CCCN(CC2)C2CCC2)cc1