Reaction Details
TargetHistamine H3 receptor
LigandBDBM50317728
Substrate/Competitorn/a
Meas. Tech.ChEMBL_629414 (CHEMBL1105767)
Ki 2.2±n/a nM
Citation Stocking, EMAluisio, LAtack, JRBonaventure, PCarruthers, NIDugovic, CEverson, AFraser, IJiang, XLeung, PLord, BLy, KSMorton, KLNepomuceno, DShah, CRShelton, JSoyode-Johnson, ALetavic, MA Novel substituted pyrrolidines are high affinity histamine H3 receptor antagonists. Bioorg Med Chem Lett20:2755-60 (2010) 
 
Histamine H3 receptor
Name:Histamine H3 receptor
Type:G Protein-Coupled Receptor (GPCR)
Mol. Mass.:48691.47
Organism:Homo sapiens (Human)
Description:Binding assays were using CHO cells stably expressing hH3R receptors.
Residue:445
BDBM50317728
NameBDBM50317728
Synonyms:1-((2R,4S)-2-(4-cyclopentyl-1,4-diazepane-1-carbonyl)-4-(3-fluorophenoxy)pyrrolidin-1-yl)ethanone | CHEMBL1097790
TypeSmall organic molecule
Emp. Form.C23H32FN3O3
Mol. Mass.417.5169
SMILESCC(=O)N1C[C@H](C[C@@H]1C(=O)N1CCCN(CC1)C1CCCC1)Oc1cccc(F)c1