Reaction Details
TargetDNA polymerase alpha catalytic subunit
LigandBDBM50090910
Substrate/Competitorn/a
Meas. Tech.ChEMBL_632672 (CHEMBL1112810)
IC50 2600±n/a nM
Citation Nieman, JANair, SKHeasley, SESchultz, BLZerth, HMNugent, RAChen, KStephanski, KJHopkins, TAKnechtel, MLOien, NLWieber, JLWathen, MW Modifications of C-2 on the pyrroloquinoline template aimed at the development of potent herpesvirus antivirals with improved aqueous solubility. Bioorg Med Chem Lett20:3039-42 (2010) 
 
DNA polymerase alpha catalytic subunit
Name:DNA polymerase alpha catalytic subunit
Type:PROTEIN
Mol. Mass.:165895.25
Organism:Homo sapiens (Human)
Description:ChEMBL_1365493
Residue:1462
BDBM50090910
NameBDBM50090910
Synonyms:3alpha,16,17,18-tetrahydroxyaphidicolone 6,13-di(hydroxymethyl)-2,6-dimethyl-(1S,2S,5R,6R,7R,10S,12R,13R)-tetracyclo[10.3.1.01,10.02,7]hexadecane-5,13-diol (Aphidicolin) CHEMBL29711 aphidicolin | cid_457964
TypeSmall organic molecule
Emp. Form.C20H34O4
Mol. Mass.338.4816
SMILESC[C@@]1(CO)[C@H](O)CC[C@@]2(C)[C@H]1CC[C@H]1C[C@@H]3C[C@]21CC[C@]3(O)CO