Reaction Details
TargetHistamine H4 receptor
LigandBDBM50319290
Substrate/Competitorn/a
Meas. Tech.ChEMBL_634016 (CHEMBL1117989)
Ki>10000±n/a nM
Citation Savall, BMEdwards, JPVenable, JDBuzard, DJThurmond, RHack, MMcGovern, P Agonist/antagonist modulation in a series of 2-aryl benzimidazole H4 receptor ligands. Bioorg Med Chem Lett20:3367-71 (2010) 
 
Histamine H4 receptor
Name:Histamine H4 receptor
Type:G Protein-Coupled Receptor (GPCR)
Mol. Mass.:44517.02
Organism:Homo sapiens (Human)
Description:Binding assays were using CHO cells stably expressing hH4R receptors.
Residue:390
BDBM50319290
NameBDBM50319290
Synonyms:(+/-)-2-(4-(3-(3,6-diazabicyclo[3.1.0]hexan-6-yl)propoxy)-2-methylphenyl)-5-fluoro-4-methyl-1H-benzo[d]imidazole | CHEMBL1085802
TypeSmall organic molecule
Emp. Form.C22H25FN4O
Mol. Mass.380.4585
SMILESCc1cc(OCCCN2C3CNCC23)ccc1-c1nc2ccc(F)c(C)c2[nH]1