Reaction Details
TargetHistamine H3 receptor
LigandBDBM50319302
Substrate/Competitorn/a
Meas. Tech.ChEMBL_634020 (CHEMBL1117993)
EC50 377±n/a nM
Citation Savall, BMEdwards, JPVenable, JDBuzard, DJThurmond, RHack, MMcGovern, P Agonist/antagonist modulation in a series of 2-aryl benzimidazole H4 receptor ligands. Bioorg Med Chem Lett20:3367-71 (2010) 
 
Histamine H3 receptor
Name:Histamine H3 receptor
Type:G Protein-Coupled Receptor (GPCR)
Mol. Mass.:48691.47
Organism:Homo sapiens (Human)
Description:Binding assays were using CHO cells stably expressing hH3R receptors.
Residue:445
BDBM50319302
NameBDBM50319302
Synonyms:5-(3-(4-(5-fluoro-4-methyl-1H-benzo[d]imidazol-2-yl)-3-methylphenoxy)propyl)-4,5,6,7-tetrahydro-3H-imidazo[4,5-c]pyridine | CHEMBL1086105
TypeSmall organic molecule
Emp. Form.C24H26FN5O
Mol. Mass.419.4945
SMILESCc1cc(OCCCN2CCc3nc[nH]c3C2)ccc1-c1nc2ccc(F)c(C)c2[nH]1