Reaction Details
TargetHistamine H4 receptor
LigandBDBM50319300
Substrate/Competitorn/a
Meas. Tech.ChEMBL_634021 (CHEMBL1117994)
EC50 548±n/a nM
Citation Savall, BMEdwards, JPVenable, JDBuzard, DJThurmond, RHack, MMcGovern, P Agonist/antagonist modulation in a series of 2-aryl benzimidazole H4 receptor ligands. Bioorg Med Chem Lett20:3367-71 (2010) 
 
Histamine H4 receptor
Name:Histamine H4 receptor
Type:G Protein-Coupled Receptor (GPCR)
Mol. Mass.:44272.75
Organism:Mus musculus (mouse)
Description:Cell pellets from SK-N-MC cells transfected with mouse H4 receptor were used in binding assay.
Residue:391
BDBM50319300
NameBDBM50319300
Synonyms:CHEMBL1083162 | N-(2-(1H-imidazol-4-yl)ethyl)-3-(4-(5-fluoro-4-methyl-1H-benzo[d]imidazol-2-yl)-3-methylphenoxy)propan-1-amine
TypeSmall organic molecule
Emp. Form.C23H26FN5O
Mol. Mass.407.4838
SMILESCc1cc(OCCCNCCc2cnc[nH]2)ccc1-c1nc2ccc(F)c(C)c2[nH]1