Reaction Details
Target5-hydroxytryptamine receptor 2A
LigandBDBM50319417
Substrate/Competitorn/a
Meas. Tech.ChEMBL_634056 (CHEMBL1118328)
Ki 5.1±n/a nM
Citation Xiong, YTeegarden, BRChoi, JSStrah-Pleynet, SDecaire, MJayakumar, HDosa, PICasper, MDPham, LFeichtinger, KUllman, BAdams, JYuskin, DFrazer, JMorgan, MSadeque, AChen, WWebb, RRConnolly, DTSemple, GAl-Shamma, H Discovery and structure-activity relationship of 3-methoxy-N-(3-(1-methyl-1H-pyrazol-5-yl)-4-(2-morpholinoethoxy)phenyl)benzamide (APD791): a highly selective 5-hydroxytryptamine2A receptor inverse agonist for the treatment of arterial thrombosis. J Med Chem53:4412-21 (2010) 
 
5-hydroxytryptamine receptor 2A
Name:5-hydroxytryptamine receptor 2A
Type:undefined
Mol. Mass.:52607.65
Organism:Homo sapiens (Human)
Description:P28223
Residue:471
BDBM50319417
NameBDBM50319417
Synonyms:3-Fluoro-N-[3-(2-methyl-2H-pyrazol-3-yl)-4-(2-morpholin-4-ylethoxy)-phenyl]-benzamide | CHEMBL1083751
TypeSmall organic molecule
Emp. Form.C23H25FN4O3
Mol. Mass.424.468
SMILESCn1nccc1-c1cc(NC(=O)c2cccc(F)c2)ccc1OCCN1CCOCC1