Reaction Details
Target5-hydroxytryptamine receptor 2A
LigandBDBM50319427
Substrate/Competitorn/a
Meas. Tech.ChEMBL_634056 (CHEMBL1118328)
Ki 15±n/a nM
Citation Xiong, YTeegarden, BRChoi, JSStrah-Pleynet, SDecaire, MJayakumar, HDosa, PICasper, MDPham, LFeichtinger, KUllman, BAdams, JYuskin, DFrazer, JMorgan, MSadeque, AChen, WWebb, RRConnolly, DTSemple, GAl-Shamma, H Discovery and structure-activity relationship of 3-methoxy-N-(3-(1-methyl-1H-pyrazol-5-yl)-4-(2-morpholinoethoxy)phenyl)benzamide (APD791): a highly selective 5-hydroxytryptamine2A receptor inverse agonist for the treatment of arterial thrombosis. J Med Chem53:4412-21 (2010) 
 
5-hydroxytryptamine receptor 2A
Name:5-hydroxytryptamine receptor 2A
Type:undefined
Mol. Mass.:52607.65
Organism:Homo sapiens (Human)
Description:P28223
Residue:471
BDBM50319427
NameBDBM50319427
Synonyms:CHEMBL1085627 | N-{4-[2-(4-Acetylpiperazin-1-yl)ethoxy]-3-(1-methyl-1H-pyrazol-5-yl)phenyl}-3-fluorobenzamide
TypeSmall organic molecule
Emp. Form.C25H28FN5O3
Mol. Mass.465.5199
SMILESCC(=O)N1CCN(CCOc2ccc(NC(=O)c3cccc(F)c3)cc2-c2ccnn2C)CC1