Reaction Details
Target5-hydroxytryptamine receptor 2C
LigandBDBM50319413
Substrate/Competitorn/a
Meas. Tech.ChEMBL_634057 (CHEMBL1118329)
Ki 225±n/a nM
Citation Xiong, YTeegarden, BRChoi, JSStrah-Pleynet, SDecaire, MJayakumar, HDosa, PICasper, MDPham, LFeichtinger, KUllman, BAdams, JYuskin, DFrazer, JMorgan, MSadeque, AChen, WWebb, RRConnolly, DTSemple, GAl-Shamma, H Discovery and structure-activity relationship of 3-methoxy-N-(3-(1-methyl-1H-pyrazol-5-yl)-4-(2-morpholinoethoxy)phenyl)benzamide (APD791): a highly selective 5-hydroxytryptamine2A receptor inverse agonist for the treatment of arterial thrombosis. J Med Chem53:4412-21 (2010) 
 
5-hydroxytryptamine receptor 2C
Name:5-hydroxytryptamine receptor 2C
Type:G Protein-Coupled Receptor (GPCR)
Mol. Mass.:51836.79
Organism:Homo sapiens (Human)
Description:P28335
Residue:458
BDBM50319413
NameBDBM50319413
Synonyms:CHEMBL1084895 | N-[3-(2-Methyl-2H-pyrazol-3-yl)-4-(2-pyrrolidin-1-ylethoxy)-phenyl]-4-trifluoromethyl-benzamide
TypeSmall organic molecule
Emp. Form.C24H25F3N4O2
Mol. Mass.458.4761
SMILESCn1nccc1-c1cc(NC(=O)c2ccc(cc2)C(F)(F)F)ccc1OCCN1CCCC1