Reaction Details
Target5-hydroxytryptamine receptor 2C
LigandBDBM50319425
Substrate/Competitorn/a
Meas. Tech.ChEMBL_634057 (CHEMBL1118329)
Ki>10000±n/a nM
Citation Xiong, YTeegarden, BRChoi, JSStrah-Pleynet, SDecaire, MJayakumar, HDosa, PICasper, MDPham, LFeichtinger, KUllman, BAdams, JYuskin, DFrazer, JMorgan, MSadeque, AChen, WWebb, RRConnolly, DTSemple, GAl-Shamma, H Discovery and structure-activity relationship of 3-methoxy-N-(3-(1-methyl-1H-pyrazol-5-yl)-4-(2-morpholinoethoxy)phenyl)benzamide (APD791): a highly selective 5-hydroxytryptamine2A receptor inverse agonist for the treatment of arterial thrombosis. J Med Chem53:4412-21 (2010) 
 
5-hydroxytryptamine receptor 2C
Name:5-hydroxytryptamine receptor 2C
Type:G Protein-Coupled Receptor (GPCR)
Mol. Mass.:51836.79
Organism:Homo sapiens (Human)
Description:P28335
Residue:458
BDBM50319425
NameBDBM50319425
Synonyms:CHEMBL1084865 | N-{3-(4-Chloro-2-methyl-2H-pyrazol-3-yl)-4-[2-(3-oxo-piperazin-1-yl)-ethoxy]-phenyl}-3-trifluoromethyl-benzamide
TypeSmall organic molecule
Emp. Form.C24H23ClF3N5O3
Mol. Mass.521.919
SMILESCn1ncc(Cl)c1-c1cc(NC(=O)c2cccc(c2)C(F)(F)F)ccc1OCCN1CCNC(=O)C1