Reaction Details
TargetTransient receptor potential cation channel subfamily V member 1
LigandBDBM50319456
Substrate/Competitorn/a
Meas. Tech.ChEMBL_634206 (CHEMBL1119788)
IC50 3.5±n/a nM
Citation Brown, BSKeddy, RPerner, RJDiDomenico, SKoenig, JRJinkerson, TKHannick, SMMcDonald, HABianchi, BRHonore, PPuttfarcken, PSMoreland, RBMarsh, KCFaltynek, CRLee, CH Discovery of TRPV1 antagonist ABT-116. Bioorg Med Chem Lett20:3291-4 (2010) 
 
Transient receptor potential cation channel subfamily V member 1
Name:Transient receptor potential cation channel subfamily V member 1
Type:Protein
Mol. Mass.:94960.75
Organism:Homo sapiens (Human)
Description:Q8NER1
Residue:839
BDBM50319456
NameBDBM50319456
Synonyms:1-(1H-indazol-4-yl)-3-((2-(piperidin-1-yl)-6-(trifluoromethyl)pyridin-3-yl)methyl)urea | CHEMBL1083396
TypeSmall organic molecule
Emp. Form.C20H21F3N6O
Mol. Mass.418.4155
SMILESFC(F)(F)c1ccc(CNC(=O)Nc2cccc3[nH]ncc23)c(n1)N1CCCCC1