Reaction Details
TargetAurora kinase B
LigandBDBM50319574
Substrate/Competitorn/a
Meas. Tech.ChEMBL_634308 (CHEMBL1120721)
IC50 454±n/a nM
Citation Cheng, ACEksterowicz, JGeuns-Meyer, SSun, Y Analysis of kinase inhibitor selectivity using a thermodynamics-based partition index. J Med Chem53:4502-10 (2010) 
 
Aurora kinase B
Name:Aurora kinase B
Type:Protein
Mol. Mass.:39327.72
Organism:Homo sapiens (Human)
Description:Q96GD4
Residue:344
BDBM50319574
NameBDBM50319574
Synonyms:CHEMBL1086334 | N-(4-(3-(2-(methylamino)pyrimidin-4-yl)pyridin-2-yloxy)naphthalen-1-yl)-3H-imidazo[4,5-c]pyridin-2-amine
TypeSmall organic molecule
Emp. Form.C26H20N8O
Mol. Mass.460.49
SMILESCNc1nccc(n1)-c1cccnc1Oc1ccc(Nc2nc3ccncc3[nH]2)c2ccccc12