Reaction Details
TargetAurora kinase B
LigandBDBM50266149
Substrate/Competitorn/a
Meas. Tech.ChEMBL_634308 (CHEMBL1120721)
IC50 23±n/a nM
Citation Cheng, ACEksterowicz, JGeuns-Meyer, SSun, Y Analysis of kinase inhibitor selectivity using a thermodynamics-based partition index. J Med Chem53:4502-10 (2010) 
 
Aurora kinase B
Name:Aurora kinase B
Type:Protein
Mol. Mass.:39327.72
Organism:Homo sapiens (Human)
Description:Q96GD4
Residue:344
BDBM50266149
NameBDBM50266149
Synonyms:1-(4-(3-(2-(methylamino)pyrimidin-4-yl)pyridin-2-yloxy)naphthalen-1-yl)-3-phenylurea | CHEMBL457099
TypeSmall organic molecule
Emp. Form.C27H22N6O2
Mol. Mass.462.5026
SMILESCNc1nccc(n1)-c1cccnc1Oc1ccc(NC(=O)Nc2ccccc2)c2ccccc12