Reaction Details
TargetAngiopoietin-1 receptor
LigandBDBM50266149
Substrate/Competitorn/a
Meas. Tech.ChEMBL_634312 (CHEMBL1120725)
IC50 5±n/a nM
Citation Cheng, ACEksterowicz, JGeuns-Meyer, SSun, Y Analysis of kinase inhibitor selectivity using a thermodynamics-based partition index. J Med Chem53:4502-10 (2010) 
 
Angiopoietin-1 receptor
Name:Angiopoietin-1 receptor
Type:Enzyme
Mol. Mass.:125835.70
Organism:Homo sapiens (Human)
Description:Q02763
Residue:1124
BDBM50266149
NameBDBM50266149
Synonyms:1-(4-(3-(2-(methylamino)pyrimidin-4-yl)pyridin-2-yloxy)naphthalen-1-yl)-3-phenylurea | CHEMBL457099
TypeSmall organic molecule
Emp. Form.C27H22N6O2
Mol. Mass.462.5026
SMILESCNc1nccc(n1)-c1cccnc1Oc1ccc(NC(=O)Nc2ccccc2)c2ccccc12