Reaction Details
TargetTyrosine-protein kinase Lck
LigandBDBM50266187
Substrate/Competitorn/a
Meas. Tech.ChEMBL_634311 (CHEMBL1120724)
IC50 25±n/a nM
Citation Cheng, ACEksterowicz, JGeuns-Meyer, SSun, Y Analysis of kinase inhibitor selectivity using a thermodynamics-based partition index. J Med Chem53:4502-10 (2010) 
 
Tyrosine-protein kinase Lck
Name:Tyrosine-protein kinase Lck
Type:n/a
Mol. Mass.:57987.83
Organism:Homo sapiens (Human)
Description:P06239
Residue:509
BDBM50266187
NameBDBM50266187
Synonyms:CHEMBL456463 | N-(4-(3-(2-(methylamino)pyrimidin-4-yl)pyridin-2-yloxy)naphthalen-1-yl)benzo[d]oxazol-2-amine
TypeSmall organic molecule
Emp. Form.C27H20N6O2
Mol. Mass.460.4867
SMILESCNc1nccc(n1)-c1cccnc1Oc1ccc(Nc2nc3ccccc3o2)c2ccccc12