Reaction Details
TargetVascular endothelial growth factor receptor 2
LigandBDBM50266188
Substrate/Competitorn/a
Meas. Tech.ChEMBL_634310 (CHEMBL1120723)
IC50 88±n/a nM
Citation Cheng, ACEksterowicz, JGeuns-Meyer, SSun, Y Analysis of kinase inhibitor selectivity using a thermodynamics-based partition index. J Med Chem53:4502-10 (2010) 
 
Vascular endothelial growth factor receptor 2
Name:Vascular endothelial growth factor receptor 2
Type:Receptor Tyrosine Kinase
Mol. Mass.:151510.97
Organism:Homo sapiens (Human)
Description:P35968
Residue:1356
BDBM50266188
NameBDBM50266188
Synonyms:CHEMBL456683 | N-(4-(3-(2-(methylamino)pyrimidin-4-yl)pyridin-2-yloxy)naphthalen-1-yl)benzo[d]thiazol-2-amine
TypeSmall organic molecule
Emp. Form.C27H20N6OS
Mol. Mass.476.552
SMILESCNc1nccc(n1)-c1cccnc1Oc1ccc(Nc2nc3ccccc3s2)c2ccccc12