Reaction Details
TargetTyrosine-protein kinase Lck
LigandBDBM50266185
Substrate/Competitorn/a
Meas. Tech.ChEMBL_634311 (CHEMBL1120724)
IC50 132±n/a nM
Citation Cheng, ACEksterowicz, JGeuns-Meyer, SSun, Y Analysis of kinase inhibitor selectivity using a thermodynamics-based partition index. J Med Chem53:4502-10 (2010) 
 
Tyrosine-protein kinase Lck
Name:Tyrosine-protein kinase Lck
Type:n/a
Mol. Mass.:57987.83
Organism:Homo sapiens (Human)
Description:P06239
Residue:509
BDBM50266185
NameBDBM50266185
Synonyms:CHEMBL463323 N-(4-(3-(2-(methylamino)pyrimidin-4-yl)pyridin-2-yloxy)naphthalen-1-yl)-6-(trifluoromethyl)-1H-benzo[d]imidazol-2-amine | N-[4-({3-[2-(methylamino)pyrimidin-4-yl]pyridin-2-yl}oxy)naphthalen-1-yl]-6-(trifluoromethyl)-1H-benzimidazol-2-amine
TypeSmall organic molecule
Emp. Form.C28H20F3N7O
Mol. Mass.527.4999
SMILESCNc1nccc(n1)-c1cccnc1Oc1ccc(Nc2nc3ccc(cc3[nH]2)C(F)(F)F)c2ccccc12