Reaction Details
TargetTyrosine-protein kinase Lck
LigandBDBM50319571
Substrate/Competitorn/a
Meas. Tech.ChEMBL_634311 (CHEMBL1120724)
IC50 387±n/a nM
Citation Cheng, ACEksterowicz, JGeuns-Meyer, SSun, Y Analysis of kinase inhibitor selectivity using a thermodynamics-based partition index. J Med Chem53:4502-10 (2010) 
 
Tyrosine-protein kinase Lck
Name:Tyrosine-protein kinase Lck
Type:n/a
Mol. Mass.:57987.83
Organism:Homo sapiens (Human)
Description:P06239
Residue:509
BDBM50319571
NameBDBM50319571
Synonyms:CHEMBL1084451 | N-(4-(3-(2-((1-ethylpiperidin-4-yl)methylamino)pyrimidin-4-yl)pyridin-2-yloxy)naphthalen-1-yl)-1H-benzo[d]imidazol-2-amine
TypeSmall organic molecule
Emp. Form.C34H34N8O
Mol. Mass.570.6868
SMILESCCN1CCC(CNc2nccc(n2)-c2cccnc2Oc2ccc(Nc3nc4ccccc4[nH]3)c3ccccc23)CC1