Reaction Details
TargetVascular endothelial growth factor receptor 2
LigandBDBM50319572
Substrate/Competitorn/a
Meas. Tech.ChEMBL_634310 (CHEMBL1120723)
IC50 2059±n/a nM
Citation Cheng, ACEksterowicz, JGeuns-Meyer, SSun, Y Analysis of kinase inhibitor selectivity using a thermodynamics-based partition index. J Med Chem53:4502-10 (2010) 
 
Vascular endothelial growth factor receptor 2
Name:Vascular endothelial growth factor receptor 2
Type:Receptor Tyrosine Kinase
Mol. Mass.:151510.97
Organism:Homo sapiens (Human)
Description:P35968
Residue:1356
BDBM50319572
NameBDBM50319572
Synonyms:CHEMBL1084452 | N-(4-(3-(2-(2-(1-methylpyrrolidin-2-yl)ethylamino)pyrimidin-4-yl)pyridin-2-yloxy)naphthalen-1-yl)-1H-benzo[d]imidazol-2-amine
TypeSmall organic molecule
Emp. Form.C33H32N8O
Mol. Mass.556.6602
SMILESCN1CCCC1CCNc1nccc(n1)-c1cccnc1Oc1ccc(Nc2nc3ccccc3[nH]2)c2ccccc12