Reaction Details
TargetAurora kinase A
LigandBDBM50266148
Substrate/Competitorn/a
Meas. Tech.ChEMBL_634309 (CHEMBL1120722)
IC50 19±n/a nM
Citation Cheng, ACEksterowicz, JGeuns-Meyer, SSun, Y Analysis of kinase inhibitor selectivity using a thermodynamics-based partition index. J Med Chem53:4502-10 (2010) 
 
Aurora kinase A
Name:Aurora kinase A
Type:Serine/threonine-protein kinase
Mol. Mass.:45830.98
Organism:Homo sapiens (Human)
Description:O14965
Residue:403
BDBM50266148
NameBDBM50266148
Synonyms:CHEMBL465793 | N-(4-(3-(2-(methylamino)pyrimidin-4-yl)pyridin-2-yloxy)naphthalen-1-yl)-1H-benzo[d]imidazol-2-amine
TypeSmall organic molecule
Emp. Form.C27H21N7O
Mol. Mass.459.5019
SMILESCNc1nccc(n1)-c1cccnc1Oc1ccc(Nc2nc3ccccc3[nH]2)c2ccccc12