Reaction Details
Target11-beta-hydroxysteroid dehydrogenase 1
LigandBDBM50319667
Substrate/Competitorn/a
Meas. Tech.ChEMBL_634657 (CHEMBL1118530)
IC50 56.8±n/a nM
Citation Véniant, MMHale, CHungate, RWGahm, KEmery, MGJona, JJoseph, SAdams, JHague, AMoniz, GZhang, JBartberger, MDLi, VSyed, RJordan, SKomorowski, RChen, MMCupples, RKim, KWSt Jean, DJJohansson, LHenriksson, MAWilliams, MVallgårda, JFotsch, CWang, M Discovery of a potent, orally active 11beta-hydroxysteroid dehydrogenase type 1 inhibitor for clinical study: identification of (S)-2-((1S,2S,4R)-bicyclo[2.2.1]heptan-2-ylamino)-5-isopropyl-5-methylthiazol-4(5H)-one (AMG 221). J Med Chem53:4481-7 (2010) 
 
11-beta-hydroxysteroid dehydrogenase 1
Name:11-beta-hydroxysteroid dehydrogenase 1
Type:Enzyme
Mol. Mass.:32409.16
Organism:Homo sapiens (Human)
Description:P28845
Residue:292
BDBM50319667
NameBDBM50319667
Synonyms:(R)-2-((1S,2S,4R)-Bicyclo[2.2.1]heptan-2-ylamino)-5-isopropyl-5-methylthiazol-4(5H)-one | CHEMBL1084347
TypeSmall organic molecule
Emp. Form.C14H22N2OS
Mol. Mass.266.402
SMILESCC(C)[C@@]1(C)SC(N[C@H]2C[C@@H]3CC[C@H]2C3)=NC1=O