Reaction Details
TargetProstaglandin D2 receptor 2
LigandBDBM50319837
Substrate/Competitorn/a
Meas. Tech.ChEMBL_634910 (CHEMBL1117650)
Ki>21000±n/a nM
Citation Colucci, JBoyd, MBerthelette, CChiasson, JFWang, ZDucharme, YFriesen, RWrona, MLevesque, JFDenis, DMathieu, MCStocco, RTherien, AGClarke, PRowland, SXu, DHan, Y Discovery of 4-[1-[([1-[4-(trifluoromethyl)benzyl]-1H-indol-7-yl]carbonyl)amino]cyclopropyl]benzoic acid (MF-766), a highly potent and selective EP4 antagonist for treating inflammatory pain. Bioorg Med Chem Lett20:3760-3 (2010) 
 
Prostaglandin D2 receptor 2
Name:Prostaglandin D2 receptor 2
Type:Enzyme
Mol. Mass.:43295.45
Organism:Homo sapiens (Human)
Description:Q9Y5Y4
Residue:395
BDBM50319837
NameBDBM50319837
Synonyms:4-(1-(1-(4-(trifluoromethyl)benzyl)-1H-indole-7-carboxamido)cyclopropyl)benzoic acid | CHEMBL1084009
TypeSmall organic molecule
Emp. Form.C27H21F3N2O3
Mol. Mass.478.4624
SMILESOC(=O)c1ccc(cc1)C1(CC1)NC(=O)c1cccc2ccn(Cc3ccc(cc3)C(F)(F)F)c12