Reaction Details
TargetProstaglandin D2 receptor
LigandBDBM50319839
Substrate/Competitorn/a
Meas. Tech.ChEMBL_634906 (CHEMBL1120633)
Ki 1389±n/a nM
Citation Colucci, JBoyd, MBerthelette, CChiasson, JFWang, ZDucharme, YFriesen, RWrona, MLevesque, JFDenis, DMathieu, MCStocco, RTherien, AGClarke, PRowland, SXu, DHan, Y Discovery of 4-[1-[([1-[4-(trifluoromethyl)benzyl]-1H-indol-7-yl]carbonyl)amino]cyclopropyl]benzoic acid (MF-766), a highly potent and selective EP4 antagonist for treating inflammatory pain. Bioorg Med Chem Lett20:3760-3 (2010) 
 
Prostaglandin D2 receptor
Name:Prostaglandin D2 receptor
Type:Enzyme
Mol. Mass.:40288.87
Organism:Homo sapiens (Human)
Description:Q13258
Residue:359
BDBM50319839
NameBDBM50319839
Synonyms:(S)-4-(1-(1-(4-(trifluoromethyl)benzyl)-1H-indole-7-carboxamido)ethyl)benzoic acid | CHEMBL1084553
TypeSmall organic molecule
Emp. Form.C26H21F3N2O3
Mol. Mass.466.4517
SMILESC[C@H](NC(=O)c1cccc2ccn(Cc3ccc(cc3)C(F)(F)F)c12)c1ccc(cc1)C(O)=O