Reaction Details
TargetProstaglandin E2 receptor EP4 subtype
LigandBDBM50319844
Substrate/Competitorn/a
Meas. Tech.ChEMBL_634905 (CHEMBL1120632)
Ki 40±n/a nM
Citation Colucci, JBoyd, MBerthelette, CChiasson, JFWang, ZDucharme, YFriesen, RWrona, MLevesque, JFDenis, DMathieu, MCStocco, RTherien, AGClarke, PRowland, SXu, DHan, Y Discovery of 4-[1-[([1-[4-(trifluoromethyl)benzyl]-1H-indol-7-yl]carbonyl)amino]cyclopropyl]benzoic acid (MF-766), a highly potent and selective EP4 antagonist for treating inflammatory pain. Bioorg Med Chem Lett20:3760-3 (2010) 
 
Prostaglandin E2 receptor EP4 subtype
Name:Prostaglandin E2 receptor EP4 subtype
Type:Enzyme
Mol. Mass.:53134.53
Organism:Homo sapiens (Human)
Description:P35408
Residue:488
BDBM50319844
NameBDBM50319844
Synonyms:(S)-4-(1-(1-(3-chlorobenzyl)-3-methyl-1H-indole-7-carboxamido)ethyl)benzoic acid | CHEMBL1083746
TypeSmall organic molecule
Emp. Form.C26H23ClN2O3
Mol. Mass.446.925
SMILESC[C@H](NC(=O)c1cccc2c(C)cn(Cc3cccc(Cl)c3)c12)c1ccc(cc1)C(O)=O