Reaction Details
TargetProstaglandin E2 receptor EP4 subtype
LigandBDBM50319845
Substrate/Competitorn/a
Meas. Tech.ChEMBL_634905 (CHEMBL1120632)
Ki 20±n/a nM
Citation Colucci, JBoyd, MBerthelette, CChiasson, JFWang, ZDucharme, YFriesen, RWrona, MLevesque, JFDenis, DMathieu, MCStocco, RTherien, AGClarke, PRowland, SXu, DHan, Y Discovery of 4-[1-[([1-[4-(trifluoromethyl)benzyl]-1H-indol-7-yl]carbonyl)amino]cyclopropyl]benzoic acid (MF-766), a highly potent and selective EP4 antagonist for treating inflammatory pain. Bioorg Med Chem Lett20:3760-3 (2010) 
 
Prostaglandin E2 receptor EP4 subtype
Name:Prostaglandin E2 receptor EP4 subtype
Type:Enzyme
Mol. Mass.:53134.53
Organism:Homo sapiens (Human)
Description:P35408
Residue:488
BDBM50319845
NameBDBM50319845
Synonyms:(S)-4-(1-(3-chloro-1-(3-chlorobenzyl)-1H-indole-7-carboxamido)ethyl)benzoic acid | CHEMBL1083445
TypeSmall organic molecule
Emp. Form.C25H20Cl2N2O3
Mol. Mass.467.344
SMILESC[C@H](NC(=O)c1cccc2c(Cl)cn(Cc3cccc(Cl)c3)c12)c1ccc(cc1)C(O)=O