Reaction Details
TargetExtracellular calcium-sensing receptor
LigandBDBM50320013
Substrate/Competitorn/a
Meas. Tech.ChEMBL_635061 (CHEMBL1119175)
IC50 200±n/a nM
Citation Shinagawa, YInoue, THirata, KKatsushima, TNakagawa, TMatsuo, YShindo, MHashimoto, H New aminopropandiol derivatives as orally available and short-acting calcium-sensing receptor antagonists. Bioorg Med Chem Lett20:3809-13 (2010) 
 
Extracellular calcium-sensing receptor
Name:Extracellular calcium-sensing receptor
Type:Protein
Mol. Mass.:120663.13
Organism:Homo sapiens (Human)
Description:P41180
Residue:1078
BDBM50320013
NameBDBM50320013
Synonyms:(2R)-1-(cyclopentyl(phenyl)methoxy)-3-(2-methyl-1-(naphthalen-2-yl)propan-2-ylamino)propan-2-ol | CHEMBL1084200
TypeSmall organic molecule
Emp. Form.C29H37NO2
Mol. Mass.431.6096
SMILESCC(C)(Cc1ccc2ccccc2c1)NC[C@@H](O)COC(C1CCCC1)c1ccccc1