Reaction Details
TargetCathepsin S
LigandBDBM50320043
Substrate/Competitorn/a
Meas. Tech.ChEMBL_635108 (CHEMBL1119418)
IC50 6.6±n/a nM
Citation Chen, JCUang, BJLyu, PCChang, JYLiu, KJKuo, CCHsieh, HPWang, HCCheng, CSChang, YHChang, MDChang, WSLin, CC Design and synthesis of alpha-ketoamides as cathepsin S inhibitors with potential applications against tumor invasion and angiogenesis. J Med Chem53:4545-9 (2010) 
 
Cathepsin S
Name:Cathepsin S
Type:Protein
Mol. Mass.:37507.38
Organism:Homo sapiens (Human)
Description:P25774
Residue:331
BDBM50320043
NameBDBM50320043
Synonyms:CHEMBL1085730 | Glycine, N-[(3S)-4-benzyloxy-3-[[[2-[(2,3-dioxo-3-(2-thienyl)propanoyl)amino]cyclohexyl-Lalanyl]carbonyl]amino]-1,2-dioxobutyl], ethyl ester
TypeSmall organic molecule
Emp. Form.C30H37N3O8S
Mol. Mass.599.695
SMILESCCOC(=O)CNC(=O)C(=O)[C@H](COCc1ccccc1)NC(=O)[C@H](CC1CCCCC1)NC(=O)C(=O)c1cccs1