Reaction Details
TargetCathepsin S
LigandBDBM50320048
Substrate/Competitorn/a
Meas. Tech.ChEMBL_635108 (CHEMBL1119418)
IC50 8.8±n/a nM
Citation Chen, JCUang, BJLyu, PCChang, JYLiu, KJKuo, CCHsieh, HPWang, HCCheng, CSChang, YHChang, MDChang, WSLin, CC Design and synthesis of alpha-ketoamides as cathepsin S inhibitors with potential applications against tumor invasion and angiogenesis. J Med Chem53:4545-9 (2010) 
 
Cathepsin S
Name:Cathepsin S
Type:Protein
Mol. Mass.:37507.38
Organism:Homo sapiens (Human)
Description:P25774
Residue:331
BDBM50320048
NameBDBM50320048
Synonyms:CHEMBL1085971 | Glycine, N-[(3S)-4-benzyloxy-(2S)-4-methyl-[[[2-[(9-oxo-9H-1-fluorenyl)carbonyl)amino]propaneyl]amino]-1,2-dioxobutyl], ethyl ester
TypeSmall organic molecule
Emp. Form.C35H37N3O8
Mol. Mass.627.6836
SMILESCCOC(=O)CNC(=O)C(=O)[C@H](COCc1ccccc1)NC(=O)[C@H](CC(C)C)NC(=O)c1cccc2-c3ccccc3C(=O)c12