Reaction Details
TargetCathepsin S
LigandBDBM50320061
Substrate/Competitorn/a
Meas. Tech.ChEMBL_635108 (CHEMBL1119418)
IC50 7.1±n/a nM
Citation Chen, JCUang, BJLyu, PCChang, JYLiu, KJKuo, CCHsieh, HPWang, HCCheng, CSChang, YHChang, MDChang, WSLin, CC Design and synthesis of alpha-ketoamides as cathepsin S inhibitors with potential applications against tumor invasion and angiogenesis. J Med Chem53:4545-9 (2010) 
 
Cathepsin S
Name:Cathepsin S
Type:Protein
Mol. Mass.:37507.38
Organism:Homo sapiens (Human)
Description:P25774
Residue:331
BDBM50320061
NameBDBM50320061
Synonyms:CHEMBL1085983 | ethyl 2-(4-(benzyloxy)-3-((S)-3-cyclohexyl-2-(1-methyl-1H-indole-2-carboxamido)propanamido)-2-oxobutanamido)acetate
TypeSmall organic molecule
Emp. Form.C34H42N4O7
Mol. Mass.618.7199
SMILESCCOC(=O)CNC(=O)C(=O)C(COCc1ccccc1)NC(=O)[C@H](CC1CCCCC1)NC(=O)c1cc2ccccc2n1C