Reaction Details
TargetCannabinoid receptor 1
LigandBDBM50320179
Substrate/Competitorn/a
Meas. Tech.ChEMBL_635412 (CHEMBL1120212)
IC50 14±n/a nM
Citation Madsen-Duggan, CBDebenham, JSWalsh, TFYan, LHuo, PWang, JTong, XLao, JFong, TMXiao, JCHuang, CRShen, CPStribling, DSShearman, LPStrack, AMGoulet, MTHale, JJ Dihydro-pyrano[2,3-b]pyridines and tetrahydro-1,8-naphthyridines as CB1 receptor inverse agonists: synthesis, SAR and biological evaluation. Bioorg Med Chem Lett20:3750-4 (2010) 
 
Cannabinoid receptor 1
Name:Cannabinoid receptor 1
Type:G Protein-Coupled Receptor (GPCR)
Mol. Mass.:52868.96
Organism:Homo sapiens (Human)
Description:P21554
Residue:472
BDBM50320179
NameBDBM50320179
Synonyms:6-(4-CHLOROPHENYL)-7-(2,4-DICHLOROPHENYL)-N-(1-HYDROXY-2-METHYLPROPAN-2-YL)-2,2-DIMETHYL-3,4-DIHYDRO-2H-PYRANO[2,3-B]PYRIDINE-4-CARBOXAMIDE (ENANTIOMERIC MIX) CHEMBL1082321
TypeSmall organic molecule
Emp. Form.C27H27Cl3N2O3
Mol. Mass.533.874
SMILESCC(C)(CO)NC(=O)C1CC(C)(C)Oc2nc(-c3ccc(Cl)cc3Cl)c(cc12)-c1ccc(Cl)cc1