Reaction Details
TargetCannabinoid receptor 1
LigandBDBM50320180
Substrate/Competitorn/a
Meas. Tech.ChEMBL_635412 (CHEMBL1120212)
IC50 3.7±n/a nM
Citation Madsen-Duggan, CBDebenham, JSWalsh, TFYan, LHuo, PWang, JTong, XLao, JFong, TMXiao, JCHuang, CRShen, CPStribling, DSShearman, LPStrack, AMGoulet, MTHale, JJ Dihydro-pyrano[2,3-b]pyridines and tetrahydro-1,8-naphthyridines as CB1 receptor inverse agonists: synthesis, SAR and biological evaluation. Bioorg Med Chem Lett20:3750-4 (2010) 
 
Cannabinoid receptor 1
Name:Cannabinoid receptor 1
Type:G Protein-Coupled Receptor (GPCR)
Mol. Mass.:52868.96
Organism:Homo sapiens (Human)
Description:P21554
Residue:472
BDBM50320180
NameBDBM50320180
Synonyms:6-(4-CHLOROPHENYL)-7-(2,4-DICHLOROPHENYL)-N-(HYDROXYMETHYL)-1,2,2-TRIMETHYL-1,2,3,4-TETRAHYDRO-1,8-NAPHTHYRIDINE-4-CARBOXAMIDE (ENANTIOMERIC MIX) CHEMBL1082330
TypeSmall organic molecule
Emp. Form.C25H24Cl3N3O2
Mol. Mass.504.836
SMILESCN1c2nc(-c3ccc(Cl)cc3Cl)c(cc2C(CC1(C)C)C(=O)NCO)-c1ccc(Cl)cc1