Reaction Details
TargetCannabinoid receptor 2
LigandBDBM50320181
Substrate/Competitorn/a
Meas. Tech.ChEMBL_635413 (CHEMBL1120213)
IC50 1280±n/a nM
Citation Madsen-Duggan, CBDebenham, JSWalsh, TFYan, LHuo, PWang, JTong, XLao, JFong, TMXiao, JCHuang, CRShen, CPStribling, DSShearman, LPStrack, AMGoulet, MTHale, JJ Dihydro-pyrano[2,3-b]pyridines and tetrahydro-1,8-naphthyridines as CB1 receptor inverse agonists: synthesis, SAR and biological evaluation. Bioorg Med Chem Lett20:3750-4 (2010) 
 
Cannabinoid receptor 2
Name:Cannabinoid receptor 2
Type:G Protein-Coupled Receptor (GPCR)
Mol. Mass.:39690.94
Organism:Homo sapiens (Human)
Description:P34972
Residue:360
BDBM50320181
NameBDBM50320181
Synonyms:6-(4-CHLOROPHENYL)-7-(2,4-DICHLOROPHENYL)-N-((R)-1-HYDROXYETHYL)-1,2,2-TRIMETHYL-1,2,3,4-TETRAHYDRO-1,8-NAPHTHYRIDINE-4-CARBOXAMIDE (ENANTIOMERIC MIX) CHEMBL1082650
TypeSmall organic molecule
Emp. Form.C26H26Cl3N3O2
Mol. Mass.518.863
SMILESC[C@@H](O)NC(=O)C1CC(C)(C)N(C)c2nc(-c3ccc(Cl)cc3Cl)c(cc12)-c1ccc(Cl)cc1