Reaction Details
TargetCannabinoid receptor 1
LigandBDBM50320186
Substrate/Competitorn/a
Meas. Tech.ChEMBL_635412 (CHEMBL1120212)
IC50 0.4±n/a nM
Citation Madsen-Duggan, CBDebenham, JSWalsh, TFYan, LHuo, PWang, JTong, XLao, JFong, TMXiao, JCHuang, CRShen, CPStribling, DSShearman, LPStrack, AMGoulet, MTHale, JJ Dihydro-pyrano[2,3-b]pyridines and tetrahydro-1,8-naphthyridines as CB1 receptor inverse agonists: synthesis, SAR and biological evaluation. Bioorg Med Chem Lett20:3750-4 (2010) 
 
Cannabinoid receptor 1
Name:Cannabinoid receptor 1
Type:G Protein-Coupled Receptor (GPCR)
Mol. Mass.:52868.96
Organism:Homo sapiens (Human)
Description:P21554
Residue:472
BDBM50320186
NameBDBM50320186
Synonyms:(2S)-N-(7'-(2-CHLOROPHENYL)-6'-(4-CHLOROPHENYL)-3',4'-DIHYDROSPIRO[CYCLOHEXANE-1,2'-PYRANO[2,3-B]PYRIDINE]-4'-YL)-2-HYDROXYPROPANAMIDE (ENANTIOMERIC MIX) CHEMBL1084820
TypeSmall organic molecule
Emp. Form.C28H28Cl2N2O3
Mol. Mass.511.44
SMILESC[C@H](O)C(=O)NC1CC2(CCCCC2)Oc2nc(-c3ccccc3Cl)c(cc12)-c1ccc(Cl)cc1