Reaction Details
TargetCannabinoid receptor 1
LigandBDBM50320190
Substrate/Competitorn/a
Meas. Tech.ChEMBL_635412 (CHEMBL1120212)
IC50 19±n/a nM
Citation Madsen-Duggan, CBDebenham, JSWalsh, TFYan, LHuo, PWang, JTong, XLao, JFong, TMXiao, JCHuang, CRShen, CPStribling, DSShearman, LPStrack, AMGoulet, MTHale, JJ Dihydro-pyrano[2,3-b]pyridines and tetrahydro-1,8-naphthyridines as CB1 receptor inverse agonists: synthesis, SAR and biological evaluation. Bioorg Med Chem Lett20:3750-4 (2010) 
 
Cannabinoid receptor 1
Name:Cannabinoid receptor 1
Type:G Protein-Coupled Receptor (GPCR)
Mol. Mass.:52868.96
Organism:Homo sapiens (Human)
Description:P21554
Residue:472
BDBM50320190
NameBDBM50320190
Synonyms:CHEMBL1085259 | rac-6-(4-chlorophenyl)-7-(2,4-dichlorophenyl)-4-methoxy-2,2-dimethyl-3,4-dihydro-2H-pyrano[2,3-b]pyridine
TypeSmall organic molecule
Emp. Form.C23H20Cl3NO2
Mol. Mass.448.769
SMILESCOC1CC(C)(C)Oc2nc(-c3ccc(Cl)cc3Cl)c(cc12)-c1ccc(Cl)cc1