Reaction Details
TargetPotassium voltage-gated channel subfamily H member 2
LigandBDBM50320176
Substrate/Competitorn/a
Meas. Tech.ChEMBL_635425 (CHEMBL1120225)
IC50 380±n/a nM
Citation Madsen-Duggan, CBDebenham, JSWalsh, TFYan, LHuo, PWang, JTong, XLao, JFong, TMXiao, JCHuang, CRShen, CPStribling, DSShearman, LPStrack, AMGoulet, MTHale, JJ Dihydro-pyrano[2,3-b]pyridines and tetrahydro-1,8-naphthyridines as CB1 receptor inverse agonists: synthesis, SAR and biological evaluation. Bioorg Med Chem Lett20:3750-4 (2010) 
 
Potassium voltage-gated channel subfamily H member 2
Name:Potassium voltage-gated channel subfamily H member 2
Type:Multi-pass membrane protein
Mol. Mass.:126672.65
Organism:Homo sapiens (Human)
Description:Q12809
Residue:1159
BDBM50320176
NameBDBM50320176
Synonyms:CHEMBL1083025 N-(6-(4-chlorophenyl)-7-(2,4-dichlorophenyl)-2,2-dimethyl-3,4-dihydro-2H-pyrano[2,3-b]pyridin-4-yl)-3-hydroxypropanamide
TypeSmall organic molecule
Emp. Form.C25H23Cl3N2O3
Mol. Mass.505.821
SMILESCC1(C)CC(NC(=O)CCO)c2cc(-c3ccc(Cl)cc3)c(nc2O1)-c1ccc(Cl)cc1Cl