Reaction Details
TargetCannabinoid receptor 1
LigandBDBM50320197
Substrate/Competitorn/a
Meas. Tech.ChEMBL_635412 (CHEMBL1120212)
IC50 1.9±n/a nM
Citation Madsen-Duggan, CBDebenham, JSWalsh, TFYan, LHuo, PWang, JTong, XLao, JFong, TMXiao, JCHuang, CRShen, CPStribling, DSShearman, LPStrack, AMGoulet, MTHale, JJ Dihydro-pyrano[2,3-b]pyridines and tetrahydro-1,8-naphthyridines as CB1 receptor inverse agonists: synthesis, SAR and biological evaluation. Bioorg Med Chem Lett20:3750-4 (2010) 
 
Cannabinoid receptor 1
Name:Cannabinoid receptor 1
Type:G Protein-Coupled Receptor (GPCR)
Mol. Mass.:52868.96
Organism:Homo sapiens (Human)
Description:P21554
Residue:472
BDBM50320197
NameBDBM50320197
Synonyms:CHEMBL1086013 | rac-2-tert-butyl-7-(2-chlorophenyl)-6-(4-chlorophenyl)-2H-pyrano[2,3-b]pyridin-4(3H)-one
TypeSmall organic molecule
Emp. Form.C24H21Cl2NO2
Mol. Mass.426.335
SMILESCC(C)(C)C1CC(=O)c2cc(-c3ccc(Cl)cc3)c(nc2O1)-c1ccccc1Cl