Reaction Details
TargetCannabinoid receptor 1
LigandBDBM50320202
Substrate/Competitorn/a
Meas. Tech.ChEMBL_635412 (CHEMBL1120212)
IC50 15±n/a nM
Citation Madsen-Duggan, CBDebenham, JSWalsh, TFYan, LHuo, PWang, JTong, XLao, JFong, TMXiao, JCHuang, CRShen, CPStribling, DSShearman, LPStrack, AMGoulet, MTHale, JJ Dihydro-pyrano[2,3-b]pyridines and tetrahydro-1,8-naphthyridines as CB1 receptor inverse agonists: synthesis, SAR and biological evaluation. Bioorg Med Chem Lett20:3750-4 (2010) 
 
Cannabinoid receptor 1
Name:Cannabinoid receptor 1
Type:G Protein-Coupled Receptor (GPCR)
Mol. Mass.:52868.96
Organism:Homo sapiens (Human)
Description:P21554
Residue:472
BDBM50320202
NameBDBM50320202
Synonyms:7-(2-chlorophenyl)-6-(4-chlorophenyl)-3,4-dihydrospiro[pyrano[2,3-b]pyridine-2,4'-[1thiane]-1',1',4-trione | CHEMBL1086271
TypeSmall organic molecule
Emp. Form.C24H19Cl2NO4S
Mol. Mass.488.383
SMILESClc1ccc(cc1)-c1cc2C(=O)CC3(CCS(=O)(=O)CC3)Oc2nc1-c1ccccc1Cl