Reaction Details
TargetDipeptidyl peptidase 4
LigandBDBM50320301
Substrate/Competitorn/a
Meas. Tech.ChEMBL_635725 (CHEMBL1120123)
IC50 12±n/a nM
Citation Cho, TPGang, LZLong, YFYang, WQian, WLei, ZJing, LJYing, FKe, YPYing, LJun, F Synthesis and biological evaluation of bicyclo[3.3.0] octane derivatives as dipeptidyl peptidase 4 inhibitors for the treatment of type 2 diabetes. Bioorg Med Chem Lett20:3521-5 (2010) 
 
Dipeptidyl peptidase 4
Name:Dipeptidyl peptidase 4
Type:Enzyme
Mol. Mass.:88271.01
Organism:Homo sapiens (Human)
Description:P27487
Residue:766
BDBM50320301
NameBDBM50320301
Synonyms:(S)-1-(2-((2beta,3aR,5S,6aS)-5-hydroxyoctahydropentalen-2-ylamino)acetyl)pyrrolidine-2-carbonitrile hydrochloride | CHEMBL1083589
TypeSmall organic molecule
Emp. Form.C15H23N3O2
Mol. Mass.277.362
SMILESO[C@H]1C[C@H]2C[C@H](C[C@H]2C1)NCC(=O)N1CCC[C@H]1C#N