Reaction Details
TargetProto-oncogene tyrosine-protein kinase Src
LigandBDBM50320700
Substrate/Competitorn/a
Meas. Tech.ChEMBL_638842 (CHEMBL1166966)
Ki 100±n/a nM
Citation Crespan, ERadi, MZanoli, SSchenone, SBotta, MMaga, G Dual Src and Abl inhibitors target wild type Abl and the AblT315I Imatinib-resistant mutant with different mechanisms. Bioorg Med Chem18:3999-4008 (2010) 
 
Proto-oncogene tyrosine-protein kinase Src
Name:Proto-oncogene tyrosine-protein kinase Src
Type:Protein
Mol. Mass.:59838.60
Organism:Homo sapiens (Human)
Description:P12931
Residue:536
BDBM50320700
NameBDBM50320700
Synonyms:1-[2-chloro-2-(4-fluorophenyl)ethyl]-N-(3-fluorophenyl)-1H-pyrazolo[3,4-d]pyrimidin-4-amine | CHEMBL1165511
TypeSmall organic molecule
Emp. Form.C19H14ClF2N5
Mol. Mass.385.798
SMILESFc1ccc(cc1)C(Cl)Cn1ncc2c(Nc3cccc(F)c3)ncnc12