Reaction Details
TargetBeta-glucosidase A
LigandBDBM50163440
Substrate/Competitorn/a
Meas. Tech.ChEMBL_639185 (CHEMBL1168038)
pH5±n/a
IC50 367000±n/a nM
Commentsextracted
Citation Kato, AYamashita, YNakagawa, SKoike, YAdachi, IHollinshead, JNash, RJIkeda, KAsano, N 2,5-Dideoxy-2,5-imino-d-altritol as a new class of pharmacological chaperone for Fabry disease. Bioorg Med Chem18:3790-4 (2010) 
 
Beta-glucosidase A
Name:Beta-glucosidase A
Type:PROTEIN
Mol. Mass.:53484.21
Organism:Caldocellum saccharolyticum
Description:ChEMBL_37437
Residue:455
BDBM50163440
NameBDBM50163440
Synonyms:(2R,3S,4R,5S)-2-(hydroxymethyl)piperidine-3,4,5-triol 1-deoxygalactonojirimycin D-galacto-1-Deoxynojirimycin | DGJ
TypeSmall organic molecule
Emp. Form.C6H13NO4
Mol. Mass.163.1717
SMILESOC[C@H]1NC[C@H](O)[C@@H](O)[C@H]1O