Reaction Details
TargetBeta-glucosidase A
LigandBDBM50241865
Substrate/Competitorn/a
Meas. Tech.ChEMBL_639185 (CHEMBL1168038)
pH5±n/a
IC50 19000±n/a nM
Commentsextracted
Citation Kato, AYamashita, YNakagawa, SKoike, YAdachi, IHollinshead, JNash, RJIkeda, KAsano, N 2,5-Dideoxy-2,5-imino-d-altritol as a new class of pharmacological chaperone for Fabry disease. Bioorg Med Chem18:3790-4 (2010) 
 
Beta-glucosidase A
Name:Beta-glucosidase A
Type:PROTEIN
Mol. Mass.:53484.21
Organism:Caldocellum saccharolyticum
Description:ChEMBL_37437
Residue:455
BDBM50241865
NameBDBM50241865
Synonyms:2,5-dideoxy-2,5-imino-D-altritol CHEMBL469844
TypeSmall organic molecule
Emp. Form.C6H13NO4
Mol. Mass.163.1717
SMILESOC[C@H]1N[C@H](CO)[C@H](O)[C@@H]1O